{"text_format":"1","workbook":"xlsx","n_sheets":3,"sheets":["Instructions","GOF Eligible Position","Allocation Planning"],"not_rendered":{"charts":0,"images":0,"macros":1,"external_links":2,"defined_names":5,"comments":0,"pivot_tables":0},"unopened":[],"bounds":{"document_bytes":16777216,"sheet_cells":100000,"rows_first":2000,"rows_last":500,"rows_between":2000,"halvings":0,"cell_chars":16384,"cell_head_chars":4096},"cells_cut":0,"cells_raw":0,"read":"whole","date_system":"1900"}

{"sheet":"Instructions","index":0,"n_rows":15,"n_cols":2,"rows_kept":15,"cut":false,"hidden":false,"merged":[[2,0,2,1]]}
["Region of Peel 2023 GOF Distribution Planning Tool"]
[]
["In this tool, only green cells in green tabs require your input. Please follow step-by-step below:"]
[]
["In \"GOF Eligible Position\" tab"]
["Step 1: ","Enter your GOF eligible Positions in column A and Category in column B according to Peel Region GOF Guidelines.\n- If you choose Option 1, you only need to input in column A.\n- If you choose Option 2 or 3, you need to input in column A and B.\n- You must complete this step before you proceed to Step 2. "]
[]
["In \"Allocation Planning\" tab"]
["Step 2:","Input all applicable data in green cells in columns A, B,D and J starting from row 21, use one row per staff. \n- For column B, use the drop-down menu to select the position identified in tab \"GOF Eligible Position\" for each staff."]
["Step 3:","- In Cell E7, input Total ROP GOF Allocation; \n- In Cell E9, input Total due to incremental mandatory benefits."]
["Step 4:","In cell H8, use the drop-down menu to select the hour enhancement option."]
["Step 5:","Depending your choice of option, your inputs will be:  \n- Option 1, J15 will be automatically entered; no input is required.   \n- Option 2, input cell J13 and J14; \n- Option 3, input cell J13, J14, and J15."]
["Step 6:","If selecting Option 2 or 3, ensure you check cell E15 as this will indicate if you are within your allocation.\n- If you are over your allocation, figures will show in red. \n- If  you are under you allocation, you can increase your hourly enhancements until cell E15 approaches nil."]
["Step 7:","You are ready to distribute ROP 2023 GOF enhancement funding to your staff!"]
[null,"Thank you!"]

{"sheet":"GOF Eligible Position","index":1,"n_rows":21,"n_cols":8,"rows_kept":21,"cut":false,"hidden":false,"merged":[]}
["GOF Eligible Positions"]
["Positions","Category"]
[null,null,null,"Category A"]
[null,null,null,"o Registered Early Childhood Educator"]
[null,null,null,"o Director Approved"]
[null,null,null,"o Supervisor or Assistant Supervisor"]
[]
[null,null,null,"Category B"]
[null,null,null,"o Program staff without ECE or Early Child Care Assistant"]
[null,null,null,"o Supply staff (regular casual employment status)"]
[null,null,null,"o Summer staff that work for numerous weeks each year to cover ratios (permanent)"]
[null,null,null,"o Non-program staff that spend up to 25% of their time supporting ratio requirements under the CCEYA"]
[]
[]
[]
[]
[]
[]
[]
[]
[null,null,null,null,null,null,null,"f"]

{"sheet":"Allocation Planning","index":2,"n_rows":520,"n_cols":13,"rows_kept":520,"cut":false,"hidden":false,"merged":[[17,10,18,10],[17,0,18,0],[17,1,18,1],[17,2,18,2],[17,5,17,7],[17,3,18,3],[17,4,18,4],[17,8,18,8],[17,9,18,9]]}
["Region of Peel 2023 GOF Distribution Planning Tool"]
[]
[null,null,null,null,null,null,"Choice of Options:"]
[null,null,null,null,null,null,"Option 1:  ","Per hour enhancement to all eligible staff"]
[null,null,null,null,null,null,"Option 2:  ","Per Position Type"]
[null,null,null,null,null,null,"Option 3:  ","Combination of option 1 &2"]
[null,null,null,"Total ROP GOF Allocation"]
[null,null,null,"ROP GOF Allocation to Staff Wages - Available",{"$f":"E7-E9","v":0},null,"My choice:","Option 1"]
[null,null,null,"Total due to incremental mandatory benefits - Available"]
[null,null,null,null,null,null,null,null,"Total number of hours worked by all eligible staff",{"$f":"E20","v":0}]
[null,null,null,"Total ROP GOF Allocation - Planning",{"$f":"K20","v":0},null,null,null,"Hourly Wage Enhancement",{"$f":"IF(J10=0,0,E8/J10)","v":0}]
[null,null,null,"ROP GOF Allocation to Staff Wages - Planning",{"$f":"I20","v":0}]
[null,null,null,"Incremental changes to mandatory benefits - Planning",{"$f":"J20","v":0},null,null,null," Hourly Wage Enhancement per staff - Category A"]
[null,null,null,null,null,null,null,null," Hourly Wage Enhancement per staff - Category B"]
[null,null,null,"ROP GOF Allocation to Staff - Remaining",{"$f":"E7-E11","v":0},null,null,null," Hourly Equal Wage Enhancement for All Staff",{"$f":"J11","v":0}]
[]
["Staff Allocation Detail"]
["Staff Name","Position","Position Category","Planned Working \n/Paid Program Hours","Eligible Planned Working \n/Paid Program Hours","Hourly Enhancement",null,null,"GOF enhancement amount per individual","Mandatory Benefits","Gross Salary and Benefits Paid to Employee"]
[null,null,null,null,null,"Per Hour Equal","Per Hour Position Type","Per Hour Total"]
["Total",null,null,{"$f":"SUM(D21:D5991)","v":0},{"$f":"SUM(E21:E5991)","v":0},null,null,null,{"$f":"SUM(I21:I5991)","v":0},{"$f":"SUM(J21:J5991)","v":0},{"$f":"SUM(K21:K5991)","v":0}]
[null,null,{"$f":"IF(B21=\"\",\"\",VLOOKUP(B21,'GOF Eligible Position'!$A:$B,2,FALSE))","v":""},null,{"$f":"IF($B21=\"\",0,IF(D21>2080,2080,D21))","v":0},{"$f":"IF($B21=\"\",0,$J$15)","v":0},{"$f":"IF($C21=\"Category A\",$J$13,IF($C21=\"Category B\",$J$14,0))","v":0},{"$f":"F21+G21","v":0},{"$f":"E21*H21","v":0},null,{"$f":"I21+J21","v":0}]
[null,null,{"$f":"IF(B22=\"\",\"\",VLOOKUP(B22,'GOF Eligible Position'!$A:$B,2,FALSE))","v":""},null,{"$f":"IF($B22=\"\",0,IF(D22>2080,2080,D22))","v":0},{"$f":"IF($B22=\"\",0,$J$15)","v":0},{"$f":"IF($C22=\"Category A\",$J$13,IF($C22=\"Category B\",$J$14,0))","v":0},{"$f":"F22+G22","v":0},{"$f":"E22*H22","v":0},null,{"$f":"I22+J22","v":0},null,"-"]
[null,null,{"$f":"IF(B23=\"\",\"\",VLOOKUP(B23,'GOF Eligible Position'!$A:$B,2,FALSE))","v":""},null,0,0,0,0,0,null,0]
[null,null,{"$f":"IF(B24=\"\",\"\",VLOOKUP(B24,'GOF Eligible Position'!$A:$B,2,FALSE))","v":""},null,0,0,0,0,0,null,0]
[null,null,{"$f":"IF(B25=\"\",\"\",VLOOKUP(B25,'GOF Eligible Position'!$A:$B,2,FALSE))","v":""},null,0,0,0,0,0,null,0]
[null,null,{"$f":"IF(B26=\"\",\"\",VLOOKUP(B26,'GOF Eligible Position'!$A:$B,2,FALSE))","v":""},null,0,0,0,0,0,null,0]
[null,null,{"$f":"IF(B27=\"\",\"\",VLOOKUP(B27,'GOF Eligible Position'!$A:$B,2,FALSE))","v":""},null,0,0,0,0,0,null,0]
[null,null,{"$f":"IF(B28=\"\",\"\",VLOOKUP(B28,'GOF Eligible Position'!$A:$B,2,FALSE))","v":""},null,0,0,0,0,0,null,0]
[null,null,{"$f":"IF(B29=\"\",\"\",VLOOKUP(B29,'GOF Eligible Position'!$A:$B,2,FALSE))","v":""},null,0,0,0,0,0,null,0]
[null,null,{"$f":"IF(B30=\"\",\"\",VLOOKUP(B30,'GOF Eligible Position'!$A:$B,2,FALSE))","v":""},null,0,0,0,0,0,null,0]
[null,null,{"$f":"IF(B31=\"\",\"\",VLOOKUP(B31,'GOF Eligible Position'!$A:$B,2,FALSE))","v":""},null,{"$f":"IF($B31=\"\",0,IF(D31>2080,2080,D31))","v":0},0,0,{"$f":"F31+G31","v":0},{"$f":"E31*H31","v":0},null,0]
[null,null,{"$f":"IF(B32=\"\",\"\",VLOOKUP(B32,'GOF Eligible Position'!$A:$B,2,FALSE))","v":""},null,0,0,0,0,0,null,0]
[null,null,{"$f":"IF(B33=\"\",\"\",VLOOKUP(B33,'GOF Eligible Position'!$A:$B,2,FALSE))","v":""},null,0,0,0,0,0,null,0]
[null,null,{"$f":"IF(B34=\"\",\"\",VLOOKUP(B34,'GOF Eligible Position'!$A:$B,2,FALSE))","v":""},null,0,0,0,0,0,null,0]
[null,null,{"$f":"IF(B35=\"\",\"\",VLOOKUP(B35,'GOF Eligible Position'!$A:$B,2,FALSE))","v":""},null,0,0,0,0,0,null,0]
[null,null,{"$f":"IF(B36=\"\",\"\",VLOOKUP(B36,'GOF Eligible Position'!$A:$B,2,FALSE))","v":""},null,0,0,0,0,0,null,0]
[null,null,{"$f":"IF(B37=\"\",\"\",VLOOKUP(B37,'GOF Eligible Position'!$A:$B,2,FALSE))","v":""},null,0,0,0,0,0,null,0]
[null,null,{"$f":"IF(B38=\"\",\"\",VLOOKUP(B38,'GOF Eligible Position'!$A:$B,2,FALSE))","v":""},null,0,0,0,0,0,null,0]
[null,null,{"$f":"IF(B39=\"\",\"\",VLOOKUP(B39,'GOF Eligible Position'!$A:$B,2,FALSE))","v":""},null,0,0,0,0,0,null,0]
[null,null,{"$f":"IF(B40=\"\",\"\",VLOOKUP(B40,'GOF Eligible Position'!$A:$B,2,FALSE))","v":""},null,0,0,0,0,0,null,0]
[null,null,{"$f":"IF(B41=\"\",\"\",VLOOKUP(B41,'GOF Eligible Position'!$A:$B,2,FALSE))","v":""},null,0,0,0,0,0,null,0]
[null,null,{"$f":"IF(B42=\"\",\"\",VLOOKUP(B42,'GOF Eligible Position'!$A:$B,2,FALSE))","v":""},null,0,0,0,0,0,null,0]
[null,null,{"$f":"IF(B43=\"\",\"\",VLOOKUP(B43,'GOF Eligible Position'!$A:$B,2,FALSE))","v":""},null,0,0,0,0,0,null,0]
[null,null,{"$f":"IF(B44=\"\",\"\",VLOOKUP(B44,'GOF Eligible Position'!$A:$B,2,FALSE))","v":""},null,0,0,0,0,0,null,0]
[null,null,{"$f":"IF(B45=\"\",\"\",VLOOKUP(B45,'GOF Eligible Position'!$A:$B,2,FALSE))","v":""},null,0,0,0,0,0,null,0]
[null,null,{"$f":"IF(B46=\"\",\"\",VLOOKUP(B46,'GOF Eligible Position'!$A:$B,2,FALSE))","v":""},null,0,0,0,0,0,null,0]
[null,null,{"$f":"IF(B47=\"\",\"\",VLOOKUP(B47,'GOF Eligible Position'!$A:$B,2,FALSE))","v":""},null,0,0,0,0,0,null,0]
[null,null,{"$f":"IF(B48=\"\",\"\",VLOOKUP(B48,'GOF Eligible Position'!$A:$B,2,FALSE))","v":""},null,0,0,0,0,0,null,0]
[null,null,{"$f":"IF(B49=\"\",\"\",VLOOKUP(B49,'GOF Eligible Position'!$A:$B,2,FALSE))","v":""},null,0,0,0,0,0,null,0]
[null,null,{"$f":"IF(B50=\"\",\"\",VLOOKUP(B50,'GOF Eligible Position'!$A:$B,2,FALSE))","v":""},null,0,0,0,0,0,null,0]
[null,null,{"$f":"IF(B51=\"\",\"\",VLOOKUP(B51,'GOF Eligible Position'!$A:$B,2,FALSE))","v":""},null,0,0,0,0,0,null,0]
[null,null,{"$f":"IF(B52=\"\",\"\",VLOOKUP(B52,'GOF Eligible Position'!$A:$B,2,FALSE))","v":""},null,0,0,0,0,0,null,0]
[null,null,{"$f":"IF(B53=\"\",\"\",VLOOKUP(B53,'GOF Eligible Position'!$A:$B,2,FALSE))","v":""},null,0,0,0,0,0,null,0]
[null,null,{"$f":"IF(B54=\"\",\"\",VLOOKUP(B54,'GOF Eligible Position'!$A:$B,2,FALSE))","v":""},null,0,0,0,0,0,null,0]
[null,null,{"$f":"IF(B55=\"\",\"\",VLOOKUP(B55,'GOF Eligible Position'!$A:$B,2,FALSE))","v":""},null,0,0,0,0,0,null,0]
[null,null,{"$f":"IF(B56=\"\",\"\",VLOOKUP(B56,'GOF Eligible Position'!$A:$B,2,FALSE))","v":""},null,0,0,0,0,0,null,0]
[null,null,{"$f":"IF(B57=\"\",\"\",VLOOKUP(B57,'GOF Eligible Position'!$A:$B,2,FALSE))","v":""},null,0,0,0,0,0,null,0]
[null,null,{"$f":"IF(B58=\"\",\"\",VLOOKUP(B58,'GOF Eligible Position'!$A:$B,2,FALSE))","v":""},null,0,0,0,0,0,null,0]
[null,null,{"$f":"IF(B59=\"\",\"\",VLOOKUP(B59,'GOF Eligible Position'!$A:$B,2,FALSE))","v":""},null,0,0,0,0,0,null,0]
[null,null,{"$f":"IF(B60=\"\",\"\",VLOOKUP(B60,'GOF Eligible Position'!$A:$B,2,FALSE))","v":""},null,0,0,0,0,0,null,0]
[null,null,{"$f":"IF(B61=\"\",\"\",VLOOKUP(B61,'GOF Eligible Position'!$A:$B,2,FALSE))","v":""},null,0,0,0,0,0,null,0]
[null,null,{"$f":"IF(B62=\"\",\"\",VLOOKUP(B62,'GOF Eligible Position'!$A:$B,2,FALSE))","v":""},null,0,0,0,0,0,null,0]
[null,null,{"$f":"IF(B63=\"\",\"\",VLOOKUP(B63,'GOF Eligible Position'!$A:$B,2,FALSE))","v":""},null,0,0,0,0,0,null,0]
[null,null,{"$f":"IF(B64=\"\",\"\",VLOOKUP(B64,'GOF Eligible Position'!$A:$B,2,FALSE))","v":""},null,0,0,0,0,0,null,0]
[null,null,{"$f":"IF(B65=\"\",\"\",VLOOKUP(B65,'GOF Eligible Position'!$A:$B,2,FALSE))","v":""},null,0,0,0,0,0,null,0]
[null,null,{"$f":"IF(B66=\"\",\"\",VLOOKUP(B66,'GOF Eligible Position'!$A:$B,2,FALSE))","v":""},null,0,0,0,0,0,null,0]
[null,null,{"$f":"IF(B67=\"\",\"\",VLOOKUP(B67,'GOF Eligible Position'!$A:$B,2,FALSE))","v":""},null,0,0,0,0,0,null,0]
[null,null,{"$f":"IF(B68=\"\",\"\",VLOOKUP(B68,'GOF Eligible Position'!$A:$B,2,FALSE))","v":""},null,0,0,0,0,0,null,0]
[null,null,{"$f":"IF(B69=\"\",\"\",VLOOKUP(B69,'GOF Eligible Position'!$A:$B,2,FALSE))","v":""},null,0,0,0,0,0,null,0]
[null,null,{"$f":"IF(B70=\"\",\"\",VLOOKUP(B70,'GOF Eligible Position'!$A:$B,2,FALSE))","v":""},null,0,0,0,0,0,null,0]
[null,null,{"$f":"IF(B71=\"\",\"\",VLOOKUP(B71,'GOF Eligible Position'!$A:$B,2,FALSE))","v":""},null,0,0,0,0,0,null,0]
[null,null,{"$f":"IF(B72=\"\",\"\",VLOOKUP(B72,'GOF Eligible Position'!$A:$B,2,FALSE))","v":""},null,0,0,0,0,0,null,0]
[null,null,{"$f":"IF(B73=\"\",\"\",VLOOKUP(B73,'GOF Eligible Position'!$A:$B,2,FALSE))","v":""},null,0,0,0,0,0,null,0]
[null,null,{"$f":"IF(B74=\"\",\"\",VLOOKUP(B74,'GOF Eligible Position'!$A:$B,2,FALSE))","v":""},null,0,0,0,0,0,null,0]
[null,null,{"$f":"IF(B75=\"\",\"\",VLOOKUP(B75,'GOF Eligible Position'!$A:$B,2,FALSE))","v":""},null,0,0,0,0,0,null,0]
[null,null,{"$f":"IF(B76=\"\",\"\",VLOOKUP(B76,'GOF Eligible Position'!$A:$B,2,FALSE))","v":""},null,0,0,0,0,0,null,0]
[null,null,{"$f":"IF(B77=\"\",\"\",VLOOKUP(B77,'GOF Eligible Position'!$A:$B,2,FALSE))","v":""},null,0,0,0,0,0,null,0]
[null,null,{"$f":"IF(B78=\"\",\"\",VLOOKUP(B78,'GOF Eligible Position'!$A:$B,2,FALSE))","v":""},null,0,0,0,0,0,null,0]
[null,null,{"$f":"IF(B79=\"\",\"\",VLOOKUP(B79,'GOF Eligible Position'!$A:$B,2,FALSE))","v":""},null,0,0,0,0,0,null,0]
[null,null,{"$f":"IF(B80=\"\",\"\",VLOOKUP(B80,'GOF Eligible Position'!$A:$B,2,FALSE))","v":""},null,0,0,0,0,0,null,0]
[null,null,{"$f":"IF(B81=\"\",\"\",VLOOKUP(B81,'GOF Eligible Position'!$A:$B,2,FALSE))","v":""},null,0,0,0,0,0,null,0]
[null,null,{"$f":"IF(B82=\"\",\"\",VLOOKUP(B82,'GOF Eligible Position'!$A:$B,2,FALSE))","v":""},null,0,0,0,0,0,null,0]
[null,null,{"$f":"IF(B83=\"\",\"\",VLOOKUP(B83,'GOF Eligible Position'!$A:$B,2,FALSE))","v":""},null,0,0,0,0,0,null,0]
[null,null,{"$f":"IF(B84=\"\",\"\",VLOOKUP(B84,'GOF Eligible Position'!$A:$B,2,FALSE))","v":""},null,0,0,0,0,0,null,0]
[null,null,{"$f":"IF(B85=\"\",\"\",VLOOKUP(B85,'GOF Eligible Position'!$A:$B,2,FALSE))","v":""},null,0,0,0,0,0,null,0]
[null,null,{"$f":"IF(B86=\"\",\"\",VLOOKUP(B86,'GOF Eligible Position'!$A:$B,2,FALSE))","v":""},null,0,{"$f":"IF($B86=\"\",0,$J$15)","v":0},{"$f":"IF($C86=\"Category A\",$J$13,IF($C86=\"Category B\",$J$14,0))","v":0},0,0,null,{"$f":"I86+J86","v":0}]
[null,null,{"$f":"IF(B87=\"\",\"\",VLOOKUP(B87,'GOF Eligible Position'!$A:$B,2,FALSE))","v":""},null,0,0,0,0,0,null,0]
[null,null,{"$f":"IF(B88=\"\",\"\",VLOOKUP(B88,'GOF Eligible Position'!$A:$B,2,FALSE))","v":""},null,0,0,0,0,0,null,0]
[null,null,{"$f":"IF(B89=\"\",\"\",VLOOKUP(B89,'GOF Eligible Position'!$A:$B,2,FALSE))","v":""},null,0,0,0,0,0,null,0]
[null,null,{"$f":"IF(B90=\"\",\"\",VLOOKUP(B90,'GOF Eligible Position'!$A:$B,2,FALSE))","v":""},null,0,0,0,0,0,null,0]
[null,null,{"$f":"IF(B91=\"\",\"\",VLOOKUP(B91,'GOF Eligible Position'!$A:$B,2,FALSE))","v":""},null,0,0,0,0,0,null,0]
[null,null,{"$f":"IF(B92=\"\",\"\",VLOOKUP(B92,'GOF Eligible Position'!$A:$B,2,FALSE))","v":""},null,0,0,0,0,0,null,0]
[null,null,{"$f":"IF(B93=\"\",\"\",VLOOKUP(B93,'GOF Eligible Position'!$A:$B,2,FALSE))","v":""},null,0,0,0,0,0,null,0]
[null,null,{"$f":"IF(B94=\"\",\"\",VLOOKUP(B94,'GOF Eligible Position'!$A:$B,2,FALSE))","v":""},null,0,0,0,0,0,null,0]
[null,null,{"$f":"IF(B95=\"\",\"\",VLOOKUP(B95,'GOF Eligible Position'!$A:$B,2,FALSE))","v":""},null,{"$f":"IF($B95=\"\",0,IF(D95>2080,2080,D95))","v":0},0,0,{"$f":"F95+G95","v":0},{"$f":"E95*H95","v":0},null,0]
[null,null,{"$f":"IF(B96=\"\",\"\",VLOOKUP(B96,'GOF Eligible Position'!$A:$B,2,FALSE))","v":""},null,0,0,0,0,0,null,0]
[null,null,{"$f":"IF(B97=\"\",\"\",VLOOKUP(B97,'GOF Eligible Position'!$A:$B,2,FALSE))","v":""},null,0,0,0,0,0,null,0]
[null,null,{"$f":"IF(B98=\"\",\"\",VLOOKUP(B98,'GOF Eligible Position'!$A:$B,2,FALSE))","v":""},null,0,0,0,0,0,null,0]
[null,null,{"$f":"IF(B99=\"\",\"\",VLOOKUP(B99,'GOF Eligible Position'!$A:$B,2,FALSE))","v":""},null,0,0,0,0,0,null,0]
[null,null,{"$f":"IF(B100=\"\",\"\",VLOOKUP(B100,'GOF Eligible Position'!$A:$B,2,FALSE))","v":""},null,0,0,0,0,0,null,0]
[null,null,{"$f":"IF(B101=\"\",\"\",VLOOKUP(B101,'GOF Eligible Position'!$A:$B,2,FALSE))","v":""},null,0,0,0,0,0,null,0]
[null,null,{"$f":"IF(B102=\"\",\"\",VLOOKUP(B102,'GOF Eligible Position'!$A:$B,2,FALSE))","v":""},null,0,0,0,0,0,null,0]
[null,null,{"$f":"IF(B103=\"\",\"\",VLOOKUP(B103,'GOF Eligible Position'!$A:$B,2,FALSE))","v":""},null,0,0,0,0,0,null,0]
[null,null,{"$f":"IF(B104=\"\",\"\",VLOOKUP(B104,'GOF Eligible Position'!$A:$B,2,FALSE))","v":""},null,0,0,0,0,0,null,0]
[null,null,{"$f":"IF(B105=\"\",\"\",VLOOKUP(B105,'GOF Eligible Position'!$A:$B,2,FALSE))","v":""},null,0,0,0,0,0,null,0]
[null,null,{"$f":"IF(B106=\"\",\"\",VLOOKUP(B106,'GOF Eligible Position'!$A:$B,2,FALSE))","v":""},null,0,0,0,0,0,null,0]
[null,null,{"$f":"IF(B107=\"\",\"\",VLOOKUP(B107,'GOF Eligible Position'!$A:$B,2,FALSE))","v":""},null,0,0,0,0,0,null,0]
[null,null,{"$f":"IF(B108=\"\",\"\",VLOOKUP(B108,'GOF Eligible Position'!$A:$B,2,FALSE))","v":""},null,0,0,0,0,0,null,0]
[null,null,{"$f":"IF(B109=\"\",\"\",VLOOKUP(B109,'GOF Eligible Position'!$A:$B,2,FALSE))","v":""},null,0,0,0,0,0,null,0]
[null,null,{"$f":"IF(B110=\"\",\"\",VLOOKUP(B110,'GOF Eligible Position'!$A:$B,2,FALSE))","v":""},null,0,0,0,0,0,null,0]
[null,null,{"$f":"IF(B111=\"\",\"\",VLOOKUP(B111,'GOF Eligible Position'!$A:$B,2,FALSE))","v":""},null,0,0,0,0,0,null,0]
[null,null,{"$f":"IF(B112=\"\",\"\",VLOOKUP(B112,'GOF Eligible Position'!$A:$B,2,FALSE))","v":""},null,0,0,0,0,0,null,0]
[null,null,{"$f":"IF(B113=\"\",\"\",VLOOKUP(B113,'GOF Eligible Position'!$A:$B,2,FALSE))","v":""},null,0,0,0,0,0,null,0]
[null,null,{"$f":"IF(B114=\"\",\"\",VLOOKUP(B114,'GOF Eligible Position'!$A:$B,2,FALSE))","v":""},null,0,0,0,0,0,null,0]
[null,null,{"$f":"IF(B115=\"\",\"\",VLOOKUP(B115,'GOF Eligible Position'!$A:$B,2,FALSE))","v":""},null,0,0,0,0,0,null,0]
[null,null,{"$f":"IF(B116=\"\",\"\",VLOOKUP(B116,'GOF Eligible Position'!$A:$B,2,FALSE))","v":""},null,0,0,0,0,0,null,0]
[null,null,{"$f":"IF(B117=\"\",\"\",VLOOKUP(B117,'GOF Eligible Position'!$A:$B,2,FALSE))","v":""},null,0,0,0,0,0,null,0]
[null,null,{"$f":"IF(B118=\"\",\"\",VLOOKUP(B118,'GOF Eligible Position'!$A:$B,2,FALSE))","v":""},null,0,0,0,0,0,null,0]
[null,null,{"$f":"IF(B119=\"\",\"\",VLOOKUP(B119,'GOF Eligible Position'!$A:$B,2,FALSE))","v":""},null,0,0,0,0,0,null,0]
[null,null,{"$f":"IF(B120=\"\",\"\",VLOOKUP(B120,'GOF Eligible Position'!$A:$B,2,FALSE))","v":""},null,0,0,0,0,0,null,0]
{"$rows_left_out":400}