{"text_format":"1","workbook":"xlsx","n_sheets":16,"sheets":["Instructions","1 - Management Representation","2 - Enrolment Worksheet","3 - Provider Information","4 - Base Funding Details","6 - Subsidy Reconciliation","5-Base Operating Admin Expenses","5 - Transition Operating Grant","Definitions","4 - COVID Spending","4a - Child Absenteeism Tool","4b - Closure by PPH Tool","5 - Staff Absenteeism Tool","6 - GovGrants Input","Legend","Legend2"],"not_rendered":{"charts":0,"images":1,"macros":1,"external_links":2,"defined_names":15,"comments":0,"pivot_tables":0},"unopened":[],"bounds":{"document_bytes":16777216,"sheet_cells":100000,"rows_first":2000,"rows_last":500,"rows_between":2000,"halvings":0,"cell_chars":16384,"cell_head_chars":4096},"cells_cut":0,"cells_raw":0,"read":"whole","date_system":"1900"}

{"sheet":"Instructions","index":0,"n_rows":19,"n_cols":1,"rows_kept":19,"cut":false,"hidden":false,"merged":[]}
["Licensed Home Child Care (LHCC) 2023 Base Funding Reconciliation Template"]
[]
["Instructions"]
[]
["You will be required to use this template to complete the final reconciliation report."]
[]
["Please submit the completed template through GovGrants by the due date of January 31, 2024."]
[]
["Reference Materials"]
[]
["2023 LHCC Base Funding Memo"]
["2023 LHCC Base Funding Guideline"]
["2023 LHCC Base Funding Quick Look"]
["2023 LHCC Base Funding Question and answers"]
["2023 LHCC Base Funding Parent notice – 2023 LHCC fee reduction programs"]
{"$rows_left_out":5}
{"sheet":"1 - Management Representation","index":1,"n_rows":68,"n_cols":11,"rows_kept":68,"cut":false,"hidden":false,"merged":[[54,0,54,2],[11,1,13,5],[48,0,48,6],[35,1,35,8],[36,1,36,8],[41,1,41,8],[42,1,42,8],[43,1,43,8],[44,1,44,8],[28,0,28,9],[33,1,33,8],[34,1,34,8],[48,7,48,10],[49,0,49,2],[49,3,49,6],[49,7,52,10],[50,0,50,2],[50,3,50,6],[51,0,51,2],[51,3,51,6],[52,0,52,2],[52,3,52,6],[11,8,11,10],[17,0,17,8],[21,0,23,8],[0,0,0,10],[7,1,7,5],[7,8,7,10],[9,1,9,5],[9,8,9,10],[4,0,5,0],[4,1,5,5]]}
["Tab 1 - Agency Information and Management Representation"]
[]
[null,"Please complete all fields highlighted in green"]
[]
["Do you have a CWELCC agreement and a head office in Peel?"]
[]
[]
["Agency Name:",null,null,null,null,null,null,"Contact Name: "]
[]
["Legal Name: ",null,null,null,null,null,null,"Email Address: "]
[]
["Address: ",null,null,null,null,null,null,"Phone No: "]
[]
[]
[null,"Hold \"ALT\" and press \"Enter\" to go to next line in Address box"]
{"$rows_left_out":54}
{"sheet":"2 - Enrolment Worksheet","index":2,"n_rows":179,"n_cols":23,"rows_kept":179,"cut":false,"hidden":false,"merged":[[2,1,2,12],[0,1,0,12],[1,1,1,12],[20,0,20,1]]}
["Tab 2 - Enrolment Worksheet"]
["Fee Reduction Operating Grant only applies to School Age children  6 - 12 years old."]
["Programs Serving Ages 6-12 yrs. ","Full Fee Enrolment for January - December 2023"]
["School age (6-12 years)","January \nActual Enrolment","February \nActual Enrolment","March \nActual Enrolment","April \nActual Enrolment","May        \n Actual Enrolment","June         \n Actual Enrolment","July Actual Enrolment","August Actual Enrolment","September Actual Enrolment","October Actual Enrolment","November Actual Enrolment","December Actual Enrolment"]
["FULL-FEE PAYING FAMILIES (Based on # of Children Enrolled)",null,null,null,null,null,"BASED ON # of CHILDREN ENROLLED"]
["School age (6-12 years)"]
["Total",{"$f":"IF(SUM(B6:B6)=0,\"\",SUM(B6:B6))","v":""},"","","","","","","","","","",""]
[]
[]
[]
["LHCC BASE FUNDING - FEE REDUCTION OPERATING GRANT (FROG) (Ages 6-12 yrs)"]
[]
["School age (6-12 years)","TOTAL"]
[]
[]
{"$rows_left_out":165}
{"sheet":"3 - Provider Information","index":3,"n_rows":113,"n_cols":8,"rows_kept":113,"cut":false,"hidden":false,"merged":[[2,0,2,7],[4,4,4,6],[110,0,110,2],[111,0,111,2],[112,0,112,2],[5,0,6,0],[5,1,6,1],[5,2,6,2],[4,0,4,2]]}
["Tab 3 - Provider Information"]
[]
["NOTE: If you are experiencing a reduced number of active homes (compared to January 2020), you must reduce your monthly allocation based on the number of current active homes before you allocate payments to home child care providers. For details, please refer to the 2023 LHCC Base Funding Guideline (p. 5-6). If your number of active homes has increased (compared to January 2020), you can distribute the full amount of your provider payment allocation. If you are experiencing a significant increase in the number of home child care providers that are caring for children, please inform your Early Years Specialist."]
[]
["FINAL RECONCILIATION",null,null,null,"FOR FINAL RECONCILIATION ONLY"]
["Home Child Care Provider (Initials)","Postal Code","Total Number of Days Worked YTD Dec 31, 2023",null,"Original (Base) ","LHCC - Payments to HCC Providers","LHCC - Historical Funding","TOTAL PAYMENTS"]
[null,null,null,null,"Payments (Excluding ROP Subsidies)","2023 LHCC Payments to Providers","2023 Historical Funding Used for Providers","Total Payments (Including ROP Subsidies)"]
[null,null,null,null,null,null,null,{"$f":"IF(+E8+F8+G8=0,\"\",+E8+F8+G8)","v":""}]
[null,null,null,null,null,null,null,""]
[null,null,null,null,null,null,null,""]
[null,null,null,null,null,null,null,""]
[null,null,null,null,null,null,null,""]
[null,null,null,null,null,null,null,""]
[null,null,null,null,null,null,null,""]
[null,null,null,null,null,null,null,""]
{"$rows_left_out":99}
{"sheet":"4 - Base Funding Details","index":4,"n_rows":8,"n_cols":12,"rows_kept":8,"cut":false,"hidden":false,"merged":[[1,0,1,8],[7,0,7,4],[3,10,4,10],[3,11,4,11],[3,9,4,9],[3,0,3,8],[6,0,6,4],[5,0,5,4],[4,0,4,4]]}
["Tab 4 - Base Funding Details"]
["Note: If you used Historical Funding in 2022 to enhance payments to providers, you may use underspending from the SWB component to continue to do so in 2023.\nEffective January 1, 2023, Historical Funding (applicable to eligible agencies only) has been merged with Staff Wages and Benefits (SWB) allocation to streamline funding and reduce reporting requirements."]
[]
["LHCC - PAYMENTS TO HOME VISITORS AND SUPERVISORS (SWB) ALLOCATION SUMMARY",null,null,null,null,null,null,null,null,"Benefit %","Hourly Rate Enhancement\nReasonability Check @ $5","FTE Calculation \n(/ 1754.5)"]
["POSITIONS ELIGIBLE TO RECEIVE STAFF WAGES & BENEFITS",null,null,null,null,"Total Number of hours worked/paid for each Position Category Based on Distribution Policy","Salaries Employer Paid","Benefits Employer Paid","SWB $ Paid  (Salaries & Benefits)"]
["Home Child Care Visitors",null,null,null,null,null,null,null,{"$f":"G6+H6","v":0},{"$f":"H6/G6","v":{"$error":"#DIV/0!"}},{"$f":"G6/F6","v":{"$error":"#DIV/0!"}},{"$f":"F6/1754.5","v":0}]
["Supervisors and non-Program Staff that spend at least 25% of their time in a Home Visitor position",null,null,null,null,null,null,null,0,{"$f":"H7/G7","v":{"$error":"#DIV/0!"}},{"$f":"G7/F7","v":{"$error":"#DIV/0!"}},{"$f":"F7/1754.5","v":0}]
["TOTAL ",null,null,null,null,{"$f":"SUM(F6:F7)","v":0},{"$f":"SUM(G6:G7)","v":0},{"$f":"SUM(H6:H7)","v":0},{"$f":"SUM(I6:I7)","v":0},{"$f":"H8/G8","v":{"$error":"#DIV/0!"}},{"$f":"G8/F8","v":{"$error":"#DIV/0!"}},{"$f":"F8/1754.5","v":0}]

{"sheet":"6 - Subsidy Reconciliation","index":5,"n_rows":19,"n_cols":14,"rows_kept":19,"cut":false,"hidden":true,"merged":[]}
[{"$f":"+'4 - Base Funding Details'!A1","v":"Tab 4 - Base Funding Details"}]
["Subsidy / Funds Reconciliation (Jan to Dec 2022)"]
[{"$f":"\"Account # \" &#REF!","v":{"$error":"#REF!"}}]
[]
[null,"LHCC Base Funding",null,"Approved & Paid By Region of Peel",null,"Total Amounts $ Used by Agency",null,"Total Subsidy Entitlement $","Adjustment","Tota Revised Subsidy Entitlement $",null,"Subsidy Payable to Agency (Repayable to Region)",null,"Additional Notes"]
[]
[null,"Fee Reduction Operating Grant (FROG)",null,null,null,{"$f":"+'2 - Enrolment Worksheet'!B17","v":0},null,{"$f":"+F7","v":0},0,{"$f":"+H7+I7","v":0},null,{"$f":"J7-D7","v":0}]
[]
[null,"Payments to HCC Providers",null,null,null,{"$f":"+'3 - Provider Information'!F108","v":0},null,{"$f":"IF(D9>F9,F9,D9)","v":0},0,{"$f":"+H9+I9","v":0},null,{"$f":"J9-D9","v":0}]
[]
[null,"Payments to Home Vistors and Supervisors (SWB)",null,null,null,{"$f":"+#REF!","v":{"$error":"#REF!"}},null,{"$f":"IF(D11>F11,F11,D11)","v":{"$error":"#REF!"}},0,{"$f":"+H11+I11","v":{"$error":"#REF!"}},null,{"$f":"J11-D11","v":{"$error":"#REF!"}}]
[]
[null,"Historical Funding",null,null,null,{"$f":"+'4 - Base Funding Details'!#REF!","v":{"$error":"#REF!"}},null,{"$f":"IF(D13>F13,F13,D13)","v":{"$error":"#REF!"}},0,{"$f":"+H13+I13","v":{"$error":"#REF!"}},null,{"$f":"J13-D13","v":{"$error":"#REF!"}},null,"Part 4 - Historical Allocation Funding = Use to fund staff wages and benefits"]
[]
[null,"Base Operating / Administrative Funding ",null,null,null,{"$f":"+#REF!","v":{"$error":"#REF!"}},null,{"$f":"IF(D15>F15,F15,D15)","v":{"$error":"#REF!"}},0,{"$f":"+H15+I15","v":{"$error":"#REF!"}},null,{"$f":"J15-D15","v":{"$error":"#REF!"}}]
{"$rows_left_out":5}
{"sheet":"5-Base Operating Admin Expenses","index":6,"n_rows":10,"n_cols":3,"rows_kept":10,"cut":false,"hidden":true,"merged":[]}
["5 - Base Operating Admin Expenses"]
["For eligible expenses, please refer to the 2023 Base Funding Guideline:"]
["https://www.peelregion.ca/children/working/service-providers/#homecc"]
[]
["Item","Amount $","Comments"]
["Administration Expenses",null,"Offset incremental audit and/or \nadministration/bookkeeping costs to administer reporting requirements"]
["Occupancy costs",null,"Agency lease/rent, utilities"]
["Special Purpose Expenses",null,"All eligible costs must be accounted for only once"]
["Additional Staff Wages/Benefits and/or Payments to Providers\nAmount reported on this line is in addition to amounts reported in tabs 3 and 4",null,"Support enhancements in these Base Funding components, based on agency discretion"]
["Total Spent",{"$f":"SUM(B6:B9)","v":0}]

{"sheet":"5 - Transition Operating Grant","index":7,"n_rows":32,"n_cols":2,"rows_kept":32,"cut":false,"hidden":false,"merged":[]}
["Tab 5 -Transition Operating Grant (TOG)"]
["The TOG is only for agencies with a head office in Peel that receive CWELCC funding. Please see page 7 of the 2023 LHCC Base Funding Guideline for details. Refer to the 2023 CWELCC LHCC Guideline for a list of ineligible TOG expenses (page 13)."]
["Please note, your existing base admin funding to support EYCC programs (WEG, WIF, Base Funding) has been consolidated and flowed through TOG."]
[]
["Particulars","Expenses"]
["Inflationary Rent/Lease Costs"]
["Inflationary Nutrition/Food Costs"]
["Inflationary Staff salaries and benefits"]
["Cost of audited financial statements for the licensed child care portion of your business"]
["Cost to implement CWELCC (ex. Software upgrades)"]
["Cost to meet reporting requirements"]
["Special purpose expenses"]
["Payments to home providers"]
["Other Eligible Expenses (Refer to guideline - list as needed)"]
["1)"]
{"$rows_left_out":18}
{"sheet":"Definitions","index":8,"n_rows":19,"n_cols":3,"rows_kept":19,"cut":false,"hidden":true,"merged":[]}
[null,"Definitions"]
[]
[null,"Term","Definition"]
[null,"Fiscal period","The budgetary accounting cycle. It is the length of time covered by an organization's financial statements. "]
[null,"Full-day","6 hours or more per day."]
[null,"Part-day","Less than 6 hours per day."]
[null,"Market rate","The rate charged to full fee paying parents."]
[null,"Municipal rate","The rate approved by the Region of Peel. Refer to schedule A1 in your Fee Subsidy and Funding Agreement."]
[null,"Reduced rate","Daily Market or Municipal Rate minus GOF Part 2 Daily Rate (Full-Day Rate = $12, Part-Day Rate = $6)"]
[]
[]
[]
[]
[null,"Acronyms"]
[]
{"$rows_left_out":5}
{"sheet":"4 - COVID Spending","index":9,"n_rows":74,"n_cols":17,"rows_kept":74,"cut":false,"hidden":true,"merged":[[42,16,44,16],[61,1,61,13],[63,16,64,16],[8,0,9,5],[24,1,24,13],[29,16,31,16],[37,16,38,16],[33,16,35,16],[50,16,51,16]]}
["Tab 4 - Covid Spending"]
["Instructions: "]
["Please enter the total Approved 2022 Base Funding contract amount in cell B14"]
["Cells B15 to B19 are automatically populated with the results from other tabs. Please feel free to modify the amounts if necessary."]
["Please use columns B - M for planning purposes. For In-Year Reporting and Year-End Reconciliation, please provide Actuals $ in column O. "]
["Agencies will be required to submit any supporting invoices for audited financial statements and bookkeeping/accounting expenses over $15,000 by January 31, 2022, unless otherwise directed earlier by the Region."]
["Please refer to the instructions in column Q and/or LHCC Base Funding Guideline for additional details. "]
[]
["IMPORTANT NOTE: All eligible costs must be accounted for only once under the various categories. If an agency is found to be using more than one eligible funding category to fund the same eligible cost, it may result in a funding recovery."]
[]
[]
[]
["COVID Related Expenses Summary Calculator"]
["2022 Approved LHCC Base Funding (from January to December 2022), per Contract",100,{"$f":"B14","v":100},0]
["Less: Fee Reduction Operating Grant (FROG) Used",{"$f":"+'2 - Enrolment Worksheet'!B17","v":0},{"$f":"IF(B15<0,\"Postive Number Only\",\"\")","v":""}]
{"$rows_left_out":60}
{"sheet":"4a - Child Absenteeism Tool","index":10,"n_rows":66,"n_cols":21,"rows_kept":66,"cut":false,"hidden":true,"merged":[[32,7,39,12],[15,0,15,5],[25,7,25,16],[31,7,31,12]]}
["Tab 4a - Child Absenteeism Tool",null,null,null,null,null,null,null,null,null,null,null,null,null,"Infant","Jan"]
[null,null,null,null,null,null,null,null,null,null,null,null,null,null,"Toddler","Feb"]
["Instructions",null,null,null,null,null,null,null,null,null,null,null,null,null,"Kindergarten","Mar"]
["This Absenteeism tool will calculate the cost for child absenteeism from January 1, 2022 to December 31, 2022, as applicable. Please note that you must cover a minimum of 5 days per month per child (as needed) from January to March 2022. ",null,null,null,null,null,null,null,null,null,null,null,null,null,"Preschool","Apr"]
["This tab is mandatory and must be completed. The Region may request your Child Absenteeism policy and communication to parents at any time. ",null,null,null,null,null,null,null,null,null,null,null,null,null,"School Age","May"]
["Only add the parent contribution if a family is in receipt of partial fee subsidy as the Region's contribution will be funded through your fee subsidy payment. ",null,null,null,null,null,null,null,null,null,null,null,null,null,null,"Jun"]
["If the family is not in receipt of fee subsidy, please enter the municipal rate.",null,null,null,null,null,null,null,null,null,null,null,null,null,null,"Jul"]
["For families that are fully subsidized and pay no parental contribution, no entry needs to be made below as the cost will be covered through Fee Subsidy. ",null,null,null,null,null,null,null,null,null,null,null,null,null,null,"Aug"]
["You will be required to report the number of days, number of children and expense claimed.",null,null,null,null,null,null,null,null,null,null,null,null,null,null,"Sep"]
["Important Note: Agencies should not claim the FROG for the same absent days covered under the absenteeism policy for full fee families.",null,null,null,null,null,null,null,null,null,null,null,null,null,null,"Oct"]
["If you need additional rows for input, please click on row 63 and insert the number of rows required.",null,null,null,null,null,null,null,null,null,null,null,null,null,null,"Nov"]
[null,null,null,null,null,null,null,null,null,null,null,null,null,null,null,"Dec"]
[]
["Please complete all fields highlighted in green and the Comment Box"]
[]
{"$rows_left_out":52}
{"sheet":"4b - Closure by PPH Tool","index":11,"n_rows":66,"n_cols":9,"rows_kept":66,"cut":false,"hidden":true,"merged":[[14,0,14,5]]}
["Tab 4b - Home Closure Directed by Peel Public Health (PPH)"]
["PLEASE DO NOT RECORD ABSENCES RELATED TO SCREENING ON THIS TAB. THOSE ABSENCES SHOULD ONLY BE RECORDED ON TAB 4a - CHILD ABSENTEEISM TOOL. "]
[]
["Instructions"]
["The Closure by PPH tool will calculate the cost of absenteeism related to mandatory self-isolations and home closures due to a COVID-19 outbreak from January 1-31, 2022."]
["Absences related to positives cases of COVID-19 cannot be counted towards the number of maximum absent days in your child absenteeism policy and should only be recorded on this tab."]
["This tab is mandatory and must be completed."]
["Only add the parent contribution if a family is in receipt of partial fee subsidy as the Region's contribution will be funded through your fee subsidy payment. "]
["If the family is not in receipt of fee subsidy, please enter the municipal rate."]
["For families that are fully subsidized and pay no parental contribution, no entry needs to be made below as the cost will be covered through Fee Subsidy. "]
["If you need additional rows for input, please click on row 64 and insert the number of rows required. Do not insert rows before row 63.  "]
[]
[]
["PLEASE RECORD ABSENCES RELATED TO PPH DIRECTED CLOSURES ONLY ON THIS TAB"]
["January 1-31, 2022"]
{"$rows_left_out":52}
{"sheet":"5 - Staff Absenteeism Tool","index":12,"n_rows":64,"n_cols":20,"rows_kept":64,"cut":false,"hidden":true,"merged":[[28,6,35,11],[12,0,12,4],[13,6,13,15],[27,6,27,11],[5,0,5,5]]}
["Tab 5 - Staff Absenteeism Tool",null,null,null,null,null,null,null,null,null,null,null,null,null,"Jan"]
[null,null,null,null,null,null,null,null,null,null,null,null,null,null,"Feb"]
["Instructions",null,null,null,null,null,null,null,null,null,null,null,null,null,"Mar"]
["This tab must be completed if you used your 2022 Base Funding to support an Additional Staff Absenteeism Policy (including optional staff wellness days).",null,null,null,null,null,null,null,null,null,null,null,null,null,"Apr"]
["The Region may request your additional Staff Absenteeism policy and communication to staff at any time. ",null,null,null,null,null,null,null,null,null,null,null,null,null,"May"]
["The Staff Absenteeism Tool calculates the cost from January 1, 2022 to December 31, 2022 AFTER your existing absenteeism policy has been exhausted. ",null,null,null,null,null,null,null,null,null,null,null,null,null,"Jun"]
["Eligible absences must be paid to staff as part of your regular payroll process. ",null,null,null,null,null,null,null,null,null,null,null,null,null,"Jul"]
["If you need additional rows for input, please click on row 61 and insert the number of rows required. ",null,null,null,null,null,null,null,null,null,null,null,null,null,"Aug"]
[null,null,null,null,null,null,null,null,null,null,null,null,null,null,"Sep"]
[null,null,null,null,null,null,null,null,null,null,null,null,null,null,"Oct"]
[null,null,null,null,null,null,null,null,null,null,null,null,null,null,"Nov"]
["Please complete all fields highlighted in green and the Comment Box",null,null,null,null,null,null,null,null,null,null,null,null,null,"Dec"]
["January to December 2022"]
["Staff Initials","Month","Wages and Employer Portion Benefits Per Hour Net of CEWS","Number Of Hours Supported","Expense Claimed",null,"SUMMARY - STAFF ABSENTEEISM"]
[null,null,null,null,{"$f":"C15*D15","v":0},null,"Summary","Jan","Feb","Mar","Apr","May","Jun","Jul","Aug","Sep","Oct","Nov","Dec"]
{"$rows_left_out":50}
{"sheet":"6 - GovGrants Input","index":13,"n_rows":20,"n_cols":5,"rows_kept":20,"cut":false,"hidden":false,"merged":[]}
["Tab 6 - GovGrants Input"]
["Please input the awarded budget amounts from GovGrants and then report the amounts, highlighted in yellow, under the applicable budget categories in GovGrants."]
[]
[]
[]
[]
[]
[]
[]
[]
["Budget Category","Awarded Budget","Spent this Period","Underspent/Recovery","Budget Category Explanation"]
["Staff wages and benefits",null,{"$f":"MIN('4 - Base Funding Details'!I8,B12)","v":0},{"$f":"B12-C12","v":0}]
["Operating",null,{"$f":"MIN('2 - Enrolment Worksheet'!B17,B13)","v":0},{"$f":"B13-C13","v":0},"Fee Reduction Operating Grant"]
["Pay Equity"]
["Administrative Funding",null,{"$f":"IF('1 - Management Representation'!B5=\"NO\", MIN('5-Base Operating Admin Expenses'!B10,B15), 0)","v":0},{"$f":"B15-C15","v":0},"Base \nOperating/ \nAdministration \nFunding"]
{"$rows_left_out":6}
{"sheet":"Legend","index":14,"n_rows":38,"n_cols":15,"rows_kept":38,"cut":false,"hidden":true,"merged":[[10,0,10,1]]}
[]
[]
[null,null,null,null,null,null,null,null,null,null,null,null,null,null,"Drop Down Menu"]
["Name of Age Category","Age Range of Age Category",null,null,null,null,null,null,null,null,null,null,null,null,"Infant"]
[null,null,null,null,null,null,null,null,null,null,null,null,null,null,"Toddler"]
["Infant","Younger than 18 months",null,null,null,null,null,null,null,null,null,null,null,null,"Pre-School (Not Eligible for Kindergarten)"]
["Toddler","18 months or older but younger than 30 months"]
["Pre-School (Not Eligible for Kindergarten)","30 months or older but younger than 6 years",null,null,null,null,null,null,null,null,null,null,null,null,"Part-Day"]
[null,null,null,null,null,null,null,null,null,null,null,null,null,null,"Full-Day"]
[]
["Centre-Based - Daily Fee Reduction Amounts (as per Guideline)",null,null,null,null,null,null,null,null,null,null,null,null,null,"Centre-Based"]
[null,null,null,null,null,null,null,null,null,null,null,null,null,null,"Home-Based"]
[]
["Infant"]
["Part-Day",6]
{"$rows_left_out":24}
{"sheet":"Legend2","index":15,"n_rows":56,"n_cols":3,"rows_kept":56,"cut":false,"hidden":true,"merged":[[42,0,42,1]]}
["DROP DOWN MENU ITEMS"]
[]
["Age Group"]
[]
["Infant"]
["Toddler"]
["Pre-School (Not Eligible for Kindergarten)"]
[]
["Municipal or Market"]
[]
["Market"]
["Municipal"]
[]
["Centre-Based or Home-Based"]
[]
{"$rows_left_out":41}